{"text_format":"1","workbook":"xlsx","n_sheets":10,"sheets":["Initial Benefits","Future Benefits","Future Losses","Fig.1","Fig.2","Fig.3","Fig.4","Data1","Data2","Data3"],"not_rendered":{"charts":4,"images":3,"macros":1,"external_links":0,"defined_names":7,"comments":0,"pivot_tables":0},"unopened":[],"bounds":{"document_bytes":16777216,"sheet_cells":100000,"rows_first":2000,"rows_last":500,"rows_between":2000,"halvings":0,"cell_chars":16384,"cell_head_chars":4096},"cells_cut":0,"cells_raw":0,"read":"whole","date_system":"1900"}

{"sheet":"Initial Benefits","index":0,"n_rows":26,"n_cols":14,"rows_kept":26,"cut":false,"hidden":false,"merged":[[2,9,5,9],[2,11,5,11],[2,12,5,12],[2,13,5,13],[1,1,1,2],[2,1,3,1],[2,2,3,2],[2,8,5,8],[1,4,1,9],[1,11,1,13],[2,4,5,4],[2,5,5,5],[2,6,5,6],[2,7,5,7]]}
[]
[null,"Member Details",null,null,"Retirement/Invalidity Pay",null,null,null,null,null,null,"Spouse's Pension"]
[null,"Gender >",{"$f":"IF(Data2!F1=TRUE,\"MALE\",\"FEMALE\")","v":"FEMALE"},null,"Starting\nFrom","At\nYears\nof\nAge","Fully Indexed\n(per annum)","Partly Indexed\n(per annum)","Loss\n(per annum)","After Commutation\n(per annum)",null,"Fully Indexed\n(per annum)","Partly Indexed\n(per annum)","Loss\n(per annum)"]
[]
[null,"Date of Birth >"]
[null,"Date of Retirement >"]
[null,"Uncommuted Retirement Pay >",null,null,{"$f":"C6","v":"00:00:00"},{"$f":"IF(OR($C$5=0,$C$6=0),0,INT((E7-$C$5)/365.25))","v":0},{"$f":"Data1!P10","v":0},{"$f":"IF(G7=0,0,Data1!Q10)","v":0},{"$f":"Data1!R10","v":0},{"$f":"Data1!S10","v":0},null,{"$f":"Data1!T10","v":0},{"$f":"IF(L7=0,0,Data1!U10)","v":0},{"$f":"Data1!V10","v":0}]
[null,"Number of Years which can be Commuted",{"$f":"Data2!J32","v":0},null,{"$f":"IF(E7=0,0,DATE(YEAR(E7)+1,MONTH(E7),DAY(E7)))","v":"00:00:00"},{"$f":"IF(OR($C$5=0,$C$6=0),0,INT((E8-$C$5)/365.25))","v":0},{"$f":"Data1!P11","v":0},{"$f":"IF(G8=0,0,Data1!Q11)","v":0},{"$f":"IF(G8=0,0,Data1!R11)","v":0},{"$f":"Data1!S11","v":0},null,{"$f":"Data1!T11","v":0},{"$f":"IF(L8=0,0,Data1!U11)","v":0},{"$f":"IF(L8=0,0,Data1!V11)","v":0}]
[null,"Commutation Entitlement",{"$f":"C7*C8","v":0},null,{"$f":"IF(E8=0,0,DATE(YEAR(E8)+1,MONTH(E8),DAY(E8)))","v":"00:00:00"},0,{"$f":"Data1!P12","v":0},{"$f":"IF(G9=0,0,Data1!Q12)","v":0},{"$f":"IF(G9=0,0,Data1!R12)","v":0},{"$f":"Data1!S12","v":0},null,{"$f":"Data1!T12","v":0},{"$f":"IF(L9=0,0,Data1!U12)","v":0},{"$f":"IF(L9=0,0,Data1!V12)","v":0}]
[null,"Reduced Retirement Pay",{"$f":"C7-Data2!J31","v":0},null,"00:00:00",0,{"$f":"Data1!P13","v":0},{"$f":"IF(G10=0,0,Data1!Q13)","v":0},{"$f":"IF(G10=0,0,Data1!R13)","v":0},{"$f":"Data1!S13","v":0},null,{"$f":"Data1!T13","v":0},{"$f":"IF(L10=0,0,Data1!U13)","v":0},{"$f":"IF(L10=0,0,Data1!V13)","v":0}]
{"$rows_left_out":17}
{"sheet":"Future Benefits","index":1,"n_rows":26,"n_cols":14,"rows_kept":26,"cut":false,"hidden":false,"merged":[[2,24,5,24],[1,11,1,13],[1,1,1,2],[2,1,3,1],[2,2,3,2],[2,4,5,4],[2,5,5,5],[2,6,5,6],[2,7,5,7],[2,8,5,8],[2,9,5,9],[2,13,5,13],[1,4,1,9],[2,11,5,11],[2,12,5,12]]}
[]
[null,"Member Details",null,null,"Retirement/Invalidity Pay",null,null,null,null,null,null,"Spouse's Pension"]
[null,"Gender >",{"$f":"IF(Data1!F1=TRUE,\"MALE\",\"FEMALE\")","v":"MALE"},null,"Starting\nFrom","At\nYears\nof\nAge","Fully Indexed\n(per annum)","Partly Indexed\n(per annum)","Loss\n(per annum)","After Commutation\n(per annum)",null,"Fully Indexed\n(per annum)","Partly Indexed\n(per annum)","Loss\n(per annum)"]
[]
[null,"Date of Birth >",{"$f":"'Initial Benefits'!C5","v":"00:00:00"}]
[null,"Date of Retirement >",{"$f":"'Initial Benefits'!C6","v":"00:00:00"}]
[null,"Uncommuted Retirement Pay >",{"$f":"'Initial Benefits'!C7","v":0},null,{"$f":"TODAY()","v":"2019-02-25"},{"$f":"'Future Losses'!F7","v":0},{"$f":"Data2!P10","v":0},{"$f":"IF(G7=0,0,Data2!Q10)","v":0},{"$f":"'Future Losses'!G7","v":0},{"$f":"Data2!S10","v":0},null,{"$f":"Data2!T10","v":0},{"$f":"IF(L7=0,0,Data2!U10)","v":0},{"$f":"'Future Losses'!I7","v":0}]
[null,"Number of Years which can be Commuted",{"$f":"Data2!J32","v":0},null,{"$f":"DATE(YEAR(E7)+1,MONTH(E7),DAY(E7))","v":"2020-02-25"},{"$f":"'Future Losses'!F8","v":0},{"$f":"Data2!P11","v":0},{"$f":"IF(G8=0,0,Data2!Q11)","v":0},{"$f":"'Future Losses'!G8","v":0},{"$f":"Data2!S11","v":0},null,{"$f":"Data2!T11","v":0},{"$f":"IF(L8=0,0,Data2!U11)","v":0},{"$f":"'Future Losses'!I8","v":0}]
[null,"Commutation Entitlement",{"$f":"C7*C8","v":0},null,"2021-02-25",{"$f":"'Future Losses'!F9","v":0},{"$f":"Data2!P12","v":0},{"$f":"IF(G9=0,0,Data2!Q12)","v":0},{"$f":"'Future Losses'!G9","v":0},{"$f":"Data2!S12","v":0},null,{"$f":"Data2!T12","v":0},{"$f":"IF(L9=0,0,Data2!U12)","v":0},{"$f":"'Future Losses'!I9","v":0}]
[null,"Reduced Retirement Pay",{"$f":"C7-Data2!J31","v":0},null,"2022-02-25",{"$f":"'Future Losses'!F10","v":0},{"$f":"Data2!P13","v":0},{"$f":"IF(G10=0,0,Data2!Q13)","v":0},{"$f":"'Future Losses'!G10","v":0},{"$f":"Data2!S13","v":0},null,{"$f":"Data2!T13","v":0},{"$f":"IF(L10=0,0,Data2!U13)","v":0},{"$f":"'Future Losses'!I10","v":0}]
{"$rows_left_out":17}
{"sheet":"Future Losses","index":2,"n_rows":26,"n_cols":15,"rows_kept":26,"cut":false,"hidden":false,"merged":[[2,6,5,6],[2,7,5,7],[2,11,5,11],[2,12,5,12],[1,4,1,8],[1,1,1,2],[2,1,3,1],[2,2,3,2],[2,4,5,4],[2,5,5,5],[2,14,5,14],[2,10,5,10],[1,10,1,12],[2,25,5,25],[2,8,5,8]]}
[]
[null,"Member Details",null,null,"Losses due to Partial Indexation",null,null,null,null,null,"Commutation Payback",null,null,null,"Total Losses"]
[null,"Gender >",{"$f":"IF(Data1!F1=TRUE,\"MALE\",\"FEMALE\")","v":"MALE"},null,"Starting\nFrom","At\nYears\nof\nAge","Retirement\nPay\nLoss\n(per annum)","Retirement\nPay\nTotal\nLoss","Spouse’s\nPension\nLoss\n(per annum)",null,"Total\nAmount\nRepaid","Balance\nto be\nRepaid","Repaid\nin excess\nof Amount\nCommuted",null,"Indexation Losses\nplus excess\nCommutation\nRepayments"]
[]
[null,"Date of Birth >",{"$f":"'Initial Benefits'!C5","v":"00:00:00"}]
[null,"Date of Retirement >",{"$f":"'Initial Benefits'!C6","v":"00:00:00"}]
[null,"Uncommuted Retirement Pay >",{"$f":"'Initial Benefits'!C7","v":0},null,{"$f":"TODAY()","v":"2019-02-25"},{"$f":"IF('Initial Benefits'!$C$5=0,0,INT((E7-'Initial Benefits'!$C$5)/365.25))","v":0},{"$f":"IF(OR('Initial Benefits'!$C$14=0,Data2!N10<0),0,Data2!N10)","v":0},{"$f":"IF(OR('Initial Benefits'!$C$14=0,Data2!M10<0),0,Data2!M10)","v":0},{"$f":"IF(OR('Initial Benefits'!$C$14=0,Data2!O10<0),0,Data2!O10)","v":0},null,{"$f":"(E7-'Initial Benefits'!$C$6)*Data2!$J$5","v":0},{"$f":"IF(K7-'Initial Benefits'!$C$11<0,'Initial Benefits'!$C$11-K7,0)","v":0},{"$f":"IF(K7-'Initial Benefits'!$C$11>0,K7-'Initial Benefits'!$C$11, 0)","v":0},null,{"$f":"H7+M7","v":0}]
[null,"Number of Years which can be Commuted",{"$f":"Data2!J32","v":0},null,{"$f":"DATE(YEAR(E7)+1,MONTH(E7),DAY(E7))","v":"2020-02-25"},{"$f":"IF('Initial Benefits'!$C$5=0,0,INT((E8-'Initial Benefits'!$C$5)/365.25))","v":0},{"$f":"IF(OR('Initial Benefits'!$C$14=0,Data2!N11<0),0,Data2!N11)","v":0},{"$f":"IF(OR('Initial Benefits'!$C$14=0,Data2!M11<0),0,Data2!M11)","v":0},{"$f":"IF(OR('Initial Benefits'!$C$14=0,Data2!O11<0),0,Data2!O11)","v":0},null,{"$f":"(E8-'Initial Benefits'!$C$6)*Data2!$J$5","v":0},{"$f":"IF(K8-'Initial Benefits'!$C$11<0,'Initial Benefits'!$C$11-K8,0)","v":0},{"$f":"IF(K8-'Initial Benefits'!$C$11>0,K8-'Initial Benefits'!$C$11, 0)","v":0},null,0]
[null,"Commutation Entitlement",{"$f":"C7*C8","v":0},null,"2021-02-25",{"$f":"IF('Initial Benefits'!$C$5=0,0,INT((E9-'Initial Benefits'!$C$5)/365.25))","v":0},{"$f":"IF(OR('Initial Benefits'!$C$14=0,Data2!N12<0),0,Data2!N12)","v":0},{"$f":"IF(OR('Initial Benefits'!$C$14=0,Data2!M12<0),0,Data2!M12)","v":0},{"$f":"IF(OR('Initial Benefits'!$C$14=0,Data2!O12<0),0,Data2!O12)","v":0},null,{"$f":"(E9-'Initial Benefits'!$C$6)*Data2!$J$5","v":0},{"$f":"IF(K9-'Initial Benefits'!$C$11<0,'Initial Benefits'!$C$11-K9,0)","v":0},{"$f":"IF(K9-'Initial Benefits'!$C$11>0,K9-'Initial Benefits'!$C$11, 0)","v":0},null,0]
[null,"Reduced Retirement Pay",{"$f":"C7-Data2!J31","v":0},null,"2022-02-25",{"$f":"IF('Initial Benefits'!$C$5=0,0,INT((E10-'Initial Benefits'!$C$5)/365.25))","v":0},{"$f":"IF(OR('Initial Benefits'!$C$14=0,Data2!N13<0),0,Data2!N13)","v":0},{"$f":"IF(OR('Initial Benefits'!$C$14=0,Data2!M13<0),0,Data2!M13)","v":0},{"$f":"IF(OR('Initial Benefits'!$C$14=0,Data2!O13<0),0,Data2!O13)","v":0},null,{"$f":"(E10-'Initial Benefits'!$C$6)*Data2!$J$5","v":0},{"$f":"IF(K10-'Initial Benefits'!$C$11<0,'Initial Benefits'!$C$11-K10,0)","v":0},{"$f":"IF(K10-'Initial Benefits'!$C$11>0,K10-'Initial Benefits'!$C$11, 0)","v":0},null,0]
{"$rows_left_out":17}
{"sheet":"Fig.1","index":3,"n_rows":0,"n_cols":0,"rows_kept":0,"cut":false,"hidden":false,"merged":[[1,1,32,14]]}

{"sheet":"Fig.2","index":4,"n_rows":0,"n_cols":0,"rows_kept":0,"cut":false,"hidden":false,"merged":[[1,1,32,14]]}

{"sheet":"Fig.3","index":5,"n_rows":0,"n_cols":0,"rows_kept":0,"cut":false,"hidden":false,"merged":[[1,1,32,14]]}

{"sheet":"Fig.4","index":6,"n_rows":0,"n_cols":0,"rows_kept":0,"cut":false,"hidden":false,"merged":[[1,1,32,14]]}

{"sheet":"Data1","index":7,"n_rows":55,"n_cols":22,"rows_kept":55,"cut":false,"hidden":true,"merged":[[0,0,2,0],[0,1,0,4],[0,12,4,12],[0,13,4,13],[0,14,4,14],[0,16,5,16],[0,17,5,17],[0,18,5,18],[0,19,5,19],[1,1,1,2],[1,3,1,4],[0,15,5,15]]}
["Age","Life Expectancy",null,null,null,true,false,null,null,null,null,null,"TOTAL LOSS","Indexation\nLoss","Commutation\nLoss","Loss due to\nPartial\nIndexation","Commutation\nPayback","Reduced\nRetirement\nPay","Loss due to\nPartial\nIndexation","Spouse's\nPension"]
[null,"1960-1962",null,"2015-2017"]
[null,"Male","Female","Male","Female"]
[30,41.12,46.49,51.367100000000001,55.213140000000003,null,null,null,"Interval to 1962 Life Expectancy",{"$f":"INT('Initial Benefits'!C23*365.25)","v":0},"days"]
[{"$f":"A4+1","v":31},40.18,45.53,50.407449999999997,54.231810000000003,null,null,null,"Retirement Pay Reduction Rate",{"$f":"IF(J4>0,ROUND('Initial Benefits'!C11/J4,6),0)","v":0},"per day"]
[{"$f":"A5+1","v":32},39.25,44.57,49.448920000000001,53.251989999999999]
[33,38.31,43.61,48.491639999999997,52.273780000000002,null,null,null,null,null,null,null,null,"Retirement","Spouse's","Fully","Partly",null,null,"Fully","Partly"]
[34,37.380000000000003,42.65,47.535690000000002,51.297350000000002,null,null,null,null,null,null,null,null,"Pay","Pension","Indexed","Indexed","Loss","Reduced","Indexed","Indexed","Loss"]
[35,36.450000000000003,41.7,46.581389999999999,50.322949999999999,null,null,"Start","Full Rate","Partial Rate","Difference","Pro Rata","Total Loss","Loss p/a","Loss p/a","p/a","p/a","p/a","p/a","p/a","p/a","p/a"]
[36,35.51,40.75,45.628909999999998,49.350270000000002,1,{"$f":"'Initial Benefits'!E7","v":"00:00:00"},{"$f":"IF(G10=0,0,LOOKUP(G10,Data3!A4:A166))","v":"00:00:00"},{"$f":"IF(G10=0,0,LOOKUP(G10,Data3!A4:A166,Data3!O4:O166))","v":0},{"$f":"IF(G10=0,0,LOOKUP(G10,Data3!A4:A166,Data3!U4:U166))","v":0},{"$f":"I10-J10","v":0},{"$f":"K10*(G10-H10)/14","v":0},{"$f":"IF(G10=0,0,LOOKUP(G10,Data3!A4:A166,Data3!Y4:Y166)+L10)","v":0},{"$f":"IF(G10=0,0,LOOKUP(G10,Data3!$A$4:$A$166,Data3!$V$4:$V$166))","v":0},{"$f":"IF(G10=0,0,LOOKUP(G10,Data3!$A$4:$A$166,Data3!$AE$4:$AE$166))","v":0},{"$f":"IF(G10=0,0,LOOKUP(G10,Data3!A4:A166,Data3!N4:N166))","v":0},{"$f":"IF(G10=0,0,LOOKUP(G10,Data3!A4:A166,Data3!T4:T166))","v":0},{"$f":"P10-Q10","v":0},{"$f":"IF(G10=0,0,LOOKUP(G10,Data3!A4:A166,Data3!P4:P166))","v":0},{"$f":"P10*0.625","v":0},{"$f":"Q10*0.625","v":0},{"$f":"T10-U10","v":0}]
{"$rows_left_out":46}
{"sheet":"Data2","index":8,"n_rows":55,"n_cols":22,"rows_kept":55,"cut":false,"hidden":true,"merged":[[0,13,4,13],[0,14,4,14],[0,0,2,0],[0,1,0,4],[1,1,1,2],[1,3,1,4],[0,12,4,12],[0,19,5,19],[0,15,5,15],[0,16,5,16],[0,17,5,17],[0,18,5,18]]}
["Age","Life Expectancy",null,null,null,false,false,null,null,null,null,null,"TOTAL\nLOSSES","Indexation\nLoss","Commutation\nLoss","Loss due to\nPartial\nIndexation","Commutation\nPayback","Reduced\nRetirement\nPay","Loss due to\nPartial\nIndexation","Spouse's\nPension"]
[null,"1960-1962",null,"2015-2017"]
[null,"Male","Female","Male","Female"]
[30,41.12,46.49,51.367100000000001,55.213140000000003,null,null,null,"Interval to 1962 Life Expectancy",{"$f":"INT('Initial Benefits'!C23*365.25)","v":0},"days"]
[{"$f":"A4+1","v":31},40.18,45.53,50.407449999999997,54.231810000000003,null,null,null,"Retirement Pay Reduction Rate",{"$f":"IF(J4>0,ROUND('Initial Benefits'!C11/J4,6),0)","v":0},"per day"]
[{"$f":"A5+1","v":32},39.25,44.57,49.448920000000001,53.251989999999999]
[33,38.31,43.61,48.491639999999997,52.273780000000002,null,null,null,null,null,null,null,null,"Retirement","Spouse's","Fully","Partly",null,null,"Fully","Partly"]
[34,37.380000000000003,42.65,47.535690000000002,51.297350000000002,null,null,null,null,null,null,null,null,"Pay","Pension","Indexed","Indexed","Loss","Reduced","Indexed","Indexed","Loss"]
[35,36.450000000000003,41.7,46.581389999999999,50.322949999999999,null,null,"Start","Full Rate","Partial Rate","Difference","Pro Rata","Total Loss","Loss p/a","Loss p/a","p/a","p/a","p/a","p/a","p/a","p/a","p/a"]
[36,35.51,40.75,45.628909999999998,49.350270000000002,1,{"$f":"'Future Losses'!E7","v":"2019-02-25"},{"$f":"LOOKUP(G10,Data3!A4:A166)","v":"2019-01-03"},{"$f":"LOOKUP(G10,Data3!A4:A166,Data3!O4:O166)","v":0},{"$f":"LOOKUP(G10,Data3!A4:A166,Data3!U4:U166)","v":0},{"$f":"I10-J10","v":0},{"$f":"K10*(G10-H10)/14","v":0},{"$f":"LOOKUP(G10,Data3!A4:A166,Data3!Y4:Y166)+L10","v":0},{"$f":"IF(G10=0,0,LOOKUP(G10,Data3!$A$4:$A$166,Data3!$V$4:$V$166))","v":0},{"$f":"LOOKUP(G10,Data3!$A$4:$A$166,Data3!$AE$4:$AE$166)","v":0},{"$f":"LOOKUP(G10,Data3!A4:A166,Data3!N4:N166)","v":0},{"$f":"LOOKUP(G10,Data3!A4:A166,Data3!T4:T166)","v":0},{"$f":"P10-Q10","v":0},{"$f":"LOOKUP(G10,Data3!A4:A166,Data3!P4:P166)","v":0},{"$f":"P10*0.625","v":0},{"$f":"Q10*0.625","v":0},{"$f":"T10-U10","v":0}]
{"$rows_left_out":46}
{"sheet":"Data3","index":9,"n_rows":166,"n_cols":31,"rows_kept":166,"cut":false,"hidden":true,"merged":[[0,13,0,14],[0,15,0,16],[0,19,0,20]]}
["date_from","date_to",null,null,"Start",null,"part_year","Pro Rata","55 Plus","Under 55","Age","Rate",null,"Full",null,"Reduced",null,null,"Increase","Partial",null,"Loss (p/a)","Total Full","Total Partial","Total Loss","Notional",{"$f":"N2*4","v":0},{"$f":"N2","v":0},"Spouse Full","Spouse Partial","Spouse Loss"]
[null,null,null,null,null,null,null,null,null,null,null,null,null,{"$f":"'Initial Benefits'!C7","v":0},"fortnightly",{"$f":"'Initial Benefits'!C12","v":0},"fortnightly",null,null,"Per Annum","fortnightly",null,null,null,null,{"$f":"IF('Initial Benefits'!C23=0,0,ROUND(AA1/'Initial Benefits'!C23,2))","v":0},"Increase"]
[null,null,null,null,false,null,null,null,null,null,null,0,null,{"$f":"ROUND(N2*(1+L3),2)","v":0},{"$f":"N3/365*14","v":0},{"$f":"Q3/14*365","v":0},{"$f":"P2/365*14","v":0},{"$f":"P3","v":0},null,{"$f":"N3","v":0},{"$f":"T3/365*14","v":0},null,0,0,0,{"$f":"N2-Z2","v":0},null,null,{"$f":"N3*0.625","v":0},{"$f":"AB3*0.625","v":0},{"$f":"AC3-AD3","v":0}]
["1973-07-05","1974-07-03",{"$f":"A4>'Initial Benefits'!$C$6","v":true},{"$f":"B4>'Initial Benefits'!$C$6","v":true},{"$f":"AND(D4,NOT(C4))","v":false},{"$f":"IF(E4=TRUE,'Initial Benefits'!$C$6-Data3!A4+1,0)","v":0},{"$f":"IF(C4=FALSE,0,B4-A4+1)+F4","v":364},{"$f":"IF($Q$3=0,0,IF(E3=TRUE,(Q4-$Q$3)/$Q$3))","v":0},0,0,{"$f":"INT((A4-'Initial Benefits'!$C$5)/365.25)","v":73},{"$f":"IF(E3=FALSE,IF(C4=FALSE,0,IF(K4<55,J4,I4)),H4)","v":0},null,0,{"$f":"N4/365*14","v":0},0,{"$f":"IF(C4=FALSE,Q3,Q5/(1+L5))","v":0},{"$f":"ROUND(R3*(1+L4),2)","v":0},{"$f":"P4-P3","v":0},{"$f":"T3+S4","v":0},{"$f":"T4/365*14","v":0},{"$f":"N4-T4","v":0},{"$f":"W3+O4*G4/14","v":0},{"$f":"X3+U4*G4/14","v":0},{"$f":"W4-X4","v":0},{"$f":"ROUND(Z3*(1+L4),2)","v":0},{"$f":"Z4-Z3","v":0},{"$f":"AB1+AA4","v":0},{"$f":"N4*0.625","v":0},{"$f":"AB4*0.625","v":0},{"$f":"AC4-AD4","v":0}]
["1974-07-04","1975-07-02",{"$f":"A5>'Initial Benefits'!$C$6","v":true},{"$f":"B5>'Initial Benefits'!$C$6","v":true},{"$f":"AND(D5,NOT(C5))","v":false},{"$f":"IF(E5=TRUE,'Initial Benefits'!$C$6-Data3!A5+1,0)","v":0},{"$f":"IF(C5=FALSE,0,B5-A5+1)+F5","v":364},0,0.11599999999999999,0.11599999999999999,{"$f":"INT((A5-'Initial Benefits'!$C$5)/365.25)","v":74},0.11599999999999999,null,0,0,0,0,{"$f":"ROUND(R4*(1+L5),2)","v":0},{"$f":"P5-P4","v":0},{"$f":"T4+S5","v":0},0,{"$f":"N5-T5","v":0},{"$f":"W4+O5*G5/14","v":0},{"$f":"X4+U5*G5/14","v":0},{"$f":"W5-X5","v":0},{"$f":"ROUND(Z4*(1+L5),2)","v":0},{"$f":"Z5-Z4","v":0},{"$f":"AB4+AA5","v":0},0,0,0]
["1975-07-03","1976-06-30",{"$f":"A6>'Initial Benefits'!$C$6","v":true},{"$f":"B6>'Initial Benefits'!$C$6","v":true},false,{"$f":"IF(E6=TRUE,'Initial Benefits'!$C$6-Data3!A6+1,0)","v":0},364,0,0.17600000000000002,0.17600000000000002,{"$f":"INT((A6-'Initial Benefits'!$C$5)/365.25)","v":75},0.17600000000000002,null,0,0,0,0,0,0,0,0,0,0,0,0,0,0,{"$f":"AB5+AA6","v":0},0,0,0]
["1976-07-01","1977-06-30",{"$f":"A7>'Initial Benefits'!$C$6","v":true},{"$f":"B7>'Initial Benefits'!$C$6","v":true},false,{"$f":"IF(E7=TRUE,'Initial Benefits'!$C$6-Data3!A7+1,0)","v":0},365,0,0.13400000000000001,0.13400000000000001,{"$f":"INT((A7-'Initial Benefits'!$C$5)/365.25)","v":76},0.13400000000000001,null,0,0,0,0,0,0,0,0,0,0,0,0,0,0,0,0,0,0]
["1977-06-30","1978-06-28",{"$f":"A8>'Initial Benefits'!$C$6","v":true},{"$f":"B8>'Initial Benefits'!$C$6","v":true},false,{"$f":"IF(E8=TRUE,'Initial Benefits'!$C$6-Data3!A8+1,0)","v":0},364,0,0.13600000000000001,0.13600000000000001,{"$f":"INT((A8-'Initial Benefits'!$C$5)/365.25)","v":77},0.13600000000000001,null,0,0,0,0,0,0,0,0,0,0,0,0,0,0,0,0,0,0]
["1978-06-29","1979-06-27",{"$f":"A9>'Initial Benefits'!$C$6","v":true},{"$f":"B9>'Initial Benefits'!$C$6","v":true},false,{"$f":"IF(E9=TRUE,'Initial Benefits'!$C$6-Data3!A9+1,0)","v":0},364,0,8.199999999999999E-2,8.199999999999999E-2,{"$f":"INT((A9-'Initial Benefits'!$C$5)/365.25)","v":78},8.199999999999999E-2,null,0,0,0,0,0,0,0,0,0,0,0,0,0,0,0,0,0,0]
["1979-06-28","1980-06-25",{"$f":"A10>'Initial Benefits'!$C$6","v":true},{"$f":"B10>'Initial Benefits'!$C$6","v":true},false,{"$f":"IF(E10=TRUE,'Initial Benefits'!$C$6-Data3!A10+1,0)","v":0},364,0,8.199999999999999E-2,8.199999999999999E-2,{"$f":"INT((A10-'Initial Benefits'!$C$5)/365.25)","v":79},8.199999999999999E-2,null,0,0,0,0,0,0,0,0,0,0,0,0,0,0,0,0,0,0]
{"$rows_left_out":156}